Clang Error Exit Code 1

linker command failed with exit code 1 (use -v     - 简书

linker command failed with exit code 1 (use -v - 简书

Directories and library not found in Xcode

Directories and library not found in Xcode

Driver Design & Internals — Clang 10 documentation

Driver Design & Internals — Clang 10 documentation

IBM Build Failed with Error:

IBM Build Failed with Error: "library not found for -lcrt1 3 1 o"

Swift / IOS 开发中 linker command failed with exit code 1 的问题

Swift / IOS 开发中 linker command failed with exit code 1 的问题

千尋@webプログラマ on Twitter:

千尋@webプログラマ on Twitter: "clang: error: linker command failed

Building Android, by the book: Build it  | Details | Hackaday io

Building Android, by the book: Build it | Details | Hackaday io

clang: error: linker command failed with exit code 1 while compiling

clang: error: linker command failed with exit code 1 while compiling

Directories and library not found in Xcode

Directories and library not found in Xcode

Linking CPLEX to Eclipse IDE for C/C++ (Mars 2) on Mac OS X El

Linking CPLEX to Eclipse IDE for C/C++ (Mars 2) on Mac OS X El

clang: error: linker command failed with exit code 1 (use -v to see

clang: error: linker command failed with exit code 1 (use -v to see

Native linking failed - IOS 12 Beta — Xamarin Community Forums

Native linking failed - IOS 12 Beta — Xamarin Community Forums

簡易的解決方式linker command failed with exit code 1 (use -v to see

簡易的解決方式linker command failed with exit code 1 (use -v to see

Xcode - symbol(s) not found for architecture x86_64

Xcode - symbol(s) not found for architecture x86_64

Unity5 1をiOS用にビルドした後,Xcode7のビルドでlinker command failed

Unity5 1をiOS用にビルドした後,Xcode7のビルドでlinker command failed

Having issues with Social Share integration on iOS - SDKBOX - Cocos

Having issues with Social Share integration on iOS - SDKBOX - Cocos

How to compile C++ code with VS Code and cl - 40tude

How to compile C++ code with VS Code and cl - 40tude

Notes: Nokogiri installation errors on macos | markentier tech

Notes: Nokogiri installation errors on macos | markentier tech

ld: can't open -sectcreate file: Library/Developer/Xcode/DerivedData

ld: can't open -sectcreate file: Library/Developer/Xcode/DerivedData

集成极光推送时出错clang: error: linker command failed with exit code

集成极光推送时出错clang: error: linker command failed with exit code

shareSDKb编译报错:clang: error: linker command failed with exit code

shareSDKb编译报错:clang: error: linker command failed with exit code

Me and Mark Publishing Blog | » Linker command failed with exit code 1

Me and Mark Publishing Blog | » Linker command failed with exit code 1

iOS package Undefined symbols for architecture armv7 - UE4 AnswerHub

iOS package Undefined symbols for architecture armv7 - UE4 AnswerHub

iOS Swift Newbie Gotchas Reminders #1 — clang: error: linker command

iOS Swift Newbie Gotchas Reminders #1 — clang: error: linker command

Duplicate Symbols For Architecture Arm64 Xcode 9 - Works Best Architects

Duplicate Symbols For Architecture Arm64 Xcode 9 - Works Best Architects

Error on Xcode when trying to Archive an ARFoundation Project from

Error on Xcode when trying to Archive an ARFoundation Project from

Table 2 from Randomized stress-testing of link-time optimizers

Table 2 from Randomized stress-testing of link-time optimizers

Get Started with C++ and Clang/LLVM in Visual Studio Code on macOS

Get Started with C++ and Clang/LLVM in Visual Studio Code on macOS

Lets learn mobile automation testing - calabash: Calabash IOS

Lets learn mobile automation testing - calabash: Calabash IOS

打包的Xcode项目Archive发布失败报library not found for -lcrt1 3 1 o

打包的Xcode项目Archive发布失败报library not found for -lcrt1 3 1 o

clang: error: linker command failed with exit c    - 简书

clang: error: linker command failed with exit c - 简书

使用个推出现Linker command failed with exit code 1 (use -v to see

使用个推出现Linker command failed with exit code 1 (use -v to see

iOS] clang: error: linker command failed with exit code 1 (use -v to

iOS] clang: error: linker command failed with exit code 1 (use -v to

A signature error resolution - design failed with exit code 1

A signature error resolution - design failed with exit code 1

Migrating Perfect project to Swift 4 - By

Migrating Perfect project to Swift 4 - By

MySQL error: command 'clang' failed with exit status 1 macOS Mojave

MySQL error: command 'clang' failed with exit status 1 macOS Mojave

clang: error: linker command failed with exit code 1 (use -v to see

clang: error: linker command failed with exit code 1 (use -v to see

How to fix native linking failed error in Xamarin IOS – AskXammy

How to fix native linking failed error in Xamarin IOS – AskXammy

Mac OS X: Install GCC Compiler with Xcode - nixCraft

Mac OS X: Install GCC Compiler with Xcode - nixCraft

Unity - Manual: Troubleshooting on iOS devices

Unity - Manual: Troubleshooting on iOS devices

安装mysqlclient 不成功换mysql-connector-python | 汪新来的博客

安装mysqlclient 不成功换mysql-connector-python | 汪新来的博客

Static Libraries, Frameworks, and Bitcode - Heitor T  Sergent - Medium

Static Libraries, Frameworks, and Bitcode - Heitor T Sergent - Medium

How to Setup Your Python Environment for Machine Learning with Anaconda

How to Setup Your Python Environment for Machine Learning with Anaconda

linker command failed with exit code 1 錯誤- IT閱讀

linker command failed with exit code 1 錯誤- IT閱讀

clang failed with exit code 1 - Noise & Heat

clang failed with exit code 1 - Noise & Heat

linker command failed with exit code 1 錯誤- IT閱讀

linker command failed with exit code 1 錯誤- IT閱讀

pip install mysql Error - error: command 'C:\\Program Files (x86

pip install mysql Error - error: command 'C:\\Program Files (x86

ZBar bar code reader armv7 error and solution |

ZBar bar code reader armv7 error and solution |

Developers - Can't build release iOS version - error: linker command

Developers - Can't build release iOS version - error: linker command

OC-bug: Undefined symbols for architecture i386:

OC-bug: Undefined symbols for architecture i386: "_OBJC_CLASS_$_

Peter Steinberger on Twitter:

Peter Steinberger on Twitter: "Today is a “ld: scattered reloc

Working with QuantLib in CLion | CLion Blog

Working with QuantLib in CLion | CLion Blog

Me and Mark Publishing Blog | » Linker command failed with exit code 1

Me and Mark Publishing Blog | » Linker command failed with exit code 1

The new Android Studio/Gradle exporter - Android - JUCE

The new Android Studio/Gradle exporter - Android - JUCE

Xcodeでのエラーについて - C・C++・C# 解決済み| 【OKWAVE】

Xcodeでのエラーについて - C・C++・C# 解決済み| 【OKWAVE】

clang: error: linker command failed with exit c    - 简书

clang: error: linker command failed with exit c - 简书

Trouble with mex command for Mathematica Symbolic Toolbox 2 0

Trouble with mex command for Mathematica Symbolic Toolbox 2 0

problem ios 4 2 1 (iphone 3G) + ofIphone - iOS - openFrameworks

problem ios 4 2 1 (iphone 3G) + ofIphone - iOS - openFrameworks

Object-C运行unit test时报clang: error: linker command failed with

Object-C运行unit test时报clang: error: linker command failed with

Git did not exit cleanly exit code 1 | Blog

Git did not exit cleanly exit code 1 | Blog

svn中第一次check out working copy项目下来出现ld: library not found

svn中第一次check out working copy项目下来出现ld: library not found

18367 (wxWidgets make failed on MACOSX 14 2) – wxWidgets

18367 (wxWidgets make failed on MACOSX 14 2) – wxWidgets

Solved: linker command failed when installing psycopg2 with pip3

Solved: linker command failed when installing psycopg2 with pip3

打包错误clang: error: linker command failed with ex    - 简书

打包错误clang: error: linker command failed with ex - 简书

xcode clang failed with exit code 1错误_百度知道

xcode clang failed with exit code 1错误_百度知道

clang: error: linker command failed with exit code 1, ld: warning

clang: error: linker command failed with exit code 1, ld: warning

Facebook Share Cocos2d-JS - JavaScript - Cocos Forums

Facebook Share Cocos2d-JS - JavaScript - Cocos Forums

CocoaPods third-party library compile time error linker command

CocoaPods third-party library compile time error linker command

library not found for -liPhone-lib - Unity Forum

library not found for -liPhone-lib - Unity Forum

iOS常见错误11:linker command failed with exit code 1 (use&nbs_niki的

iOS常见错误11:linker command failed with exit code 1 (use&nbs_niki的

Getting error

Getting error "linker command failed with exit code 1 (use -v to see

Xcode Test Target - Linker errors, missing headers - MacOSX and iOS

Xcode Test Target - Linker errors, missing headers - MacOSX and iOS

Xcode: clang: error: linker command failed with exit code 1 (use -v

Xcode: clang: error: linker command failed with exit code 1 (use -v

Architecture Armv7s Clang Error  iphone please how to solve this one

Architecture Armv7s Clang Error iphone please how to solve this one

Can't Build OR Buld and Deploy to iOS in Telerik AppBuilder

Can't Build OR Buld and Deploy to iOS in Telerik AppBuilder

linker command failed with exit code 1 (use -v     - 宇宙执政的个人

linker command failed with exit code 1 (use -v - 宇宙执政的个人

App Center Build Frequently Asked Questions - Visual Studio App

App Center Build Frequently Asked Questions - Visual Studio App

OSX 10 11 6) clang: error: linker command failed with exit code 1

OSX 10 11 6) clang: error: linker command failed with exit code 1

Swift 2 IOS 9 = clang: error: linker command failed with exit code 1

Swift 2 IOS 9 = clang: error: linker command failed with exit code 1

Linking an iOS Static Library Project in another Project in Xcode

Linking an iOS Static Library Project in another Project in Xcode

idea 報錯maven [ERROR] Maven execution terminated abnormally (exit

idea 報錯maven [ERROR] Maven execution terminated abnormally (exit

Xcode 9 0 1 Image Release - Announcements - CircleCI Discuss

Xcode 9 0 1 Image Release - Announcements - CircleCI Discuss

python 3 x - Installing pip3 packages  Getting

python 3 x - Installing pip3 packages Getting "command 'clang

Linking CPLEX to Eclipse IDE for C/C++ (Mars 2) on Mac OS X El

Linking CPLEX to Eclipse IDE for C/C++ (Mars 2) on Mac OS X El

Error when building SampleScene from ARFoundation to iPhone 6s

Error when building SampleScene from ARFoundation to iPhone 6s

Build Caffe with Anaconda on MacOS - Buffalo Al - Medium

Build Caffe with Anaconda on MacOS - Buffalo Al - Medium

模拟器运行正常,真机报错:clang: error: linker command failed with

模拟器运行正常,真机报错:clang: error: linker command failed with